Parcel #iu3wedr70k55d8c

Created by Anonymous
Public

Created January 31, 2024 Expires in 9 days

Loading editor...

=> xbps-src: updating repositories for host (x86_64)...
[*] Updating repository `https://repo-default.voidlinux.org/current/bootstrap/x86_64-repodata' ...
[*] Updating repository `https://repo-default.voidlinux.org/current/x86_64-repodata' ...
[*] Updating repository `https://repo-default.voidlinux.org/current/nonfree/x86_64-repodata' ...
[*] Updating repository `https://repo-default.voidlinux.org/current/debug/x86_64-repodata' ...
[*] Updating repository `https://repo-default.voidlinux.org/current/multilib/bootstrap/x86_64-repodata' ...
[*] Updating repository `https://repo-default.voidlinux.org/current/multilib/x86_64-repodata' ...
[*] Updating repository `https://repo-default.voidlinux.org/current/multilib/nonfree/x86_64-repodata' ...
=> xbps-src: updating software in / masterdir...
=> xbps-src: cleaning up / masterdir...
=> aylurs-gtk-shell-1.7.4_1: removing autodeps, please wait...
=> aylurs-gtk-shell-1.7.4_1: building with [meson] [meson] for x86_64...
   [host] nodejs-18.19.0_1: found (https://repo-default.voidlinux.org/current)
   [host] pkg-config-0.29.2_3: found (https://repo-default.voidlinux.org/current)
   [host] meson-1.3.0_1: not found
   [target] glib-devel-2.78.0_3: found (https://repo-default.voidlinux.org/current)
   [target] gobject-introspection-1.76.1_3: found (https://repo-default.voidlinux.org/current)
   [target] gjs-devel-1.76.0_1: found (https://repo-default.voidlinux.org/current)
   [target] gtk+3-devel-3.24.38_1: found (https://repo-default.voidlinux.org/current)
   [target] pulseaudio-devel-16.1_1: found (https://repo-default.voidlinux.org/current)
   [runtime] gjs-1.76.0_1: found (https://repo-default.voidlinux.org/current)
   [runtime] gtk-layer-shell-0.8.1_1: found (https://repo-default.voidlinux.org/current)
   [runtime] libsoup3-3.4.2_1: found (https://repo-default.voidlinux.org/current)
=> meson-1.3.0_1: building with [python3-module] [python3] (dependency of aylurs-gtk-shell) for x86_64...
   [host] python3-devel-3.12.1_1: not found
   [host] python3-setuptools-69.0.2_1: not found
   [target] python3-3.12.1_1: not found
   [runtime] ninja-1.11.1_4: found (https://repo-default.voidlinux.org/current)
   [runtime] python3-setuptools-69.0.2_1: not found
=> python3-3.12.1_1: building with [gnu-configure] (dependency of meson) for x86_64...
   [host] pkgconf-1.9.3_1: found (/host/binpkgs)
   [target] libffi-devel-3.3_2: found (https://repo-default.voidlinux.org/current)
   [target] readline-devel-8.2.001_1: found (https://repo-default.voidlinux.org/current)
   [target] gdbm-devel-1.23_1: found (https://repo-default.voidlinux.org/current)
   [target] openssl-devel-3.1.4_2: found (https://repo-default.voidlinux.org/current)
   [target] expat-devel-2.5.0_1: found (https://repo-default.voidlinux.org/current)
   [target] sqlite-devel-3.44.2_2: found (https://repo-default.voidlinux.org/current)
   [target] bzip2-devel-1.0.8_2: found (https://repo-default.voidlinux.org/current)
   [target] zlib-devel-1.3_1: found (/host/binpkgs)
   [target] liblzma-devel-5.4.5_1: found (https://repo-default.voidlinux.org/current)
   [runtime] ca-certificates-20230311+3.95_1: found (https://repo-default.voidlinux.org/current)
   [runtime] python3-3.12.1_1: not found (self, ignored)
=> python3-3.12.1_1: installing host dependencies: pkgconf-1.9.3_1 ...
=> python3-3.12.1_1: installing target dependencies: libffi-devel-3.3_2 readline-devel-8.2.001_1 gdbm-devel-1.23_1 openssl-devel-3.1.4_2 expat-devel-2.5.0_1 sqlite-devel-3.44.2_2 bzip2-devel-1.0.8_2 zlib-devel-1.3_1 liblzma-devel-5.4.5_1 ...
=> python3-3.12.1_1: running pre-build hook: 02-script-wrapper ...
=> python3-3.12.1_1: running do_build ...
Running code to generate profile data (this can take a while):
# First, we need to create a clean build with profile generation
# enabled.
make profile-gen-stamp
make[1]: Entering directory '/builddir/python3-3.12.1'
Building with support for profile generation:
make build_all CFLAGS_NODIST=" -fprofile-generate" LDFLAGS_NODIST=" -fprofile-generate" LIBS="-ldl "
make[2]: Entering directory '/builddir/python3-3.12.1'
x86_64-unknown-linux-gnu-gcc -Wl,-z,relro -Wl,-z,now -Wl,--as-needed     -Wl,-z,relro -Wl,-z,now -Wl,--as-needed      -fprofile-generate -o _bootstrap_python Modules/getbuildinfo.o Parser/token.o  Parser/pegen.o Parser/pegen_errors.o Parser/action_helpers.o Parser/parser.o Parser/string_parser.o Parser/peg_api.o Parser/myreadline.o Parser/tokenizer.o Objects/abstract.o Objects/boolobject.o Objects/bytes_methods.o Objects/bytearrayobject.o Objects/bytesobject.o Objects/call.o Objects/capsule.o Objects/cellobject.o Objects/classobject.o Objects/codeobject.o Objects/complexobject.o Objects/descrobject.o Objects/enumobject.o Objects/exceptions.o Objects/genericaliasobject.o Objects/genobject.o Objects/fileobject.o Objects/floatobject.o Objects/frameobject.o Objects/funcobject.o Objects/interpreteridobject.o Objects/iterobject.o Objects/listobject.o Objects/longobject.o Objects/dictobject.o Objects/odictobject.o Objects/memoryobject.o Objects/methodobject.o Objects/moduleobject.o Objects/namespaceobject.o Objects/object.o Objects/obmalloc.o Objects/picklebufobject.o Objects/rangeobject.o Objects/setobject.o Objects/sliceobject.o Objects/structseq.o Objects/tupleobject.o Objects/typeobject.o Objects/typevarobject.o Objects/unicodeobject.o Objects/unicodectype.o Objects/unionobject.o Objects/weakrefobject.o Python/asm_trampoline.o Python/_warnings.o Python/Python-ast.o Python/Python-tokenize.o Python/asdl.o Python/assemble.o Python/ast.o Python/ast_opt.o Python/ast_unparse.o Python/bltinmodule.o Python/ceval.o Python/codecs.o Python/compile.o Python/context.o Python/dynamic_annotations.o Python/errors.o Python/flowgraph.o Python/frame.o Python/frozenmain.o Python/future.o Python/getargs.o Python/getcompiler.o Python/getcopyright.o Python/getplatform.o Python/getversion.o Python/ceval_gil.o Python/hamt.o Python/hashtable.o Python/import.o Python/importdl.o Python/initconfig.o Python/instrumentation.o Python/intrinsics.o Python/legacy_tracing.o Python/marshal.o Python/modsupport.o Python/mysnprintf.o Python/mystrtoul.o Python/pathconfig.o Python/preconfig.o Python/pyarena.o Python/pyctype.o Python/pyfpe.o Python/pyhash.o Python/pylifecycle.o Python/pymath.o Python/pystate.o Python/pythonrun.o Python/pytime.o Python/bootstrap_hash.o Python/specialize.o Python/structmember.o Python/symtable.o Python/sysmodule.o Python/thread.o Python/traceback.o Python/tracemalloc.o Python/getopt.o Python/pystrcmp.o Python/pystrtod.o Python/pystrhex.o Python/dtoa.o Python/formatter_unicode.o Python/fileutils.o Python/suggestions.o Python/perf_trampoline.o Python/dynload_shlib.o     Modules/config.o Modules/main.o Modules/gcmodule.o Modules/atexitmodule.o  Modules/faulthandler.o  Modules/posixmodule.o  Modules/signalmodule.o  Modules/_tracemalloc.o  Modules/_codecsmodule.o  Modules/_collectionsmodule.o  Modules/errnomodule.o  Modules/_io/_iomodule.o Modules/_io/iobase.o Modules/_io/fileio.o Modules/_io/bytesio.o Modules/_io/bufferedio.o Modules/_io/textio.o Modules/_io/stringio.o  Modules/itertoolsmodule.o  Modules/_sre/sre.o  Modules/_threadmodule.o  Modules/timemodule.o  Modules/_typingmodule.o  Modules/_weakref.o  Modules/_abc.o  Modules/_functoolsmodule.o  Modules/_localemodule.o  Modules/_operator.o  Modules/_stat.o  Modules/symtablemodule.o  Modules/pwdmodule.o \
	Programs/_bootstrap_python.o Modules/getpath.o -ldl                         -lm 
x86_64-unknown-linux-gnu-gcc -shared -Wl,-z,relro -Wl,-z,now -Wl,--as-needed     -Wl,-z,relro -Wl,-z,now -Wl,--as-needed     -fno-semantic-interposition -fprofile-generate  Modules/zlibmodule.o -L/usr/lib -lz   -o Modules/zlib.cpython-312-x86_64-linux-gnu.so
x86_64-unknown-linux-gnu-gcc -shared -Wl,-z,relro -Wl,-z,now -Wl,--as-needed     -Wl,-z,relro -Wl,-z,now -Wl,--as-needed     -fno-semantic-interposition -fprofile-generate  Modules/_sqlite/blob.o Modules/_sqlite/connection.o Modules/_sqlite/cursor.o Modules/_sqlite/microprotocols.o Modules/_sqlite/module.o Modules/_sqlite/prepare_protocol.o Modules/_sqlite/row.o Modules/_sqlite/statement.o Modules/_sqlite/util.o -lsqlite3   -o Modules/_sqlite3.cpython-312-x86_64-linux-gnu.so
x86_64-unknown-linux-gnu-gcc -shared -Wl,-z,relro -Wl,-z,now -Wl,--as-needed     -Wl,-z,relro -Wl,-z,now -Wl,--as-needed     -fno-semantic-interposition -fprofile-generate  Modules/_ssl.o -L/usr/lib   -lssl -lcrypto   -o Modules/_ssl.cpython-312-x86_64-linux-gnu.so
x86_64-unknown-linux-gnu-gcc -shared -Wl,-z,relro -Wl,-z,now -Wl,--as-needed     -Wl,-z,relro -Wl,-z,now -Wl,--as-needed     -fno-semantic-interposition -fprofile-generate  Modules/_hashopenssl.o -L/usr/lib    -lcrypto  -o Modules/_hashlib.cpython-312-x86_64-linux-gnu.so
x86_64-unknown-linux-gnu-gcc -shared -Wl,-z,relro -Wl,-z,now -Wl,--as-needed     -Wl,-z,relro -Wl,-z,now -Wl,--as-needed     -fno-semantic-interposition -fprofile-generate  Modules/xxsubtype.o   -o Modules/xxsubtype.cpython-312-x86_64-linux-gnu.so
x86_64-unknown-linux-gnu-gcc -shared -Wl,-z,relro -Wl,-z,now -Wl,--as-needed     -Wl,-z,relro -Wl,-z,now -Wl,--as-needed     -fno-semantic-interposition -fprofile-generate  Modules/_xxtestfuzz/_xxtestfuzz.o Modules/_xxtestfuzz/fuzzer.o   -o Modules/_xxtestfuzz.cpython-312-x86_64-linux-gnu.so
x86_64-unknown-linux-gnu-gcc -shared -Wl,-z,relro -Wl,-z,now -Wl,--as-needed     -Wl,-z,relro -Wl,-z,now -Wl,--as-needed     -fno-semantic-interposition -fprofile-generate  Modules/_testbuffer.o   -o Modules/_testbuffer.cpython-312-x86_64-linux-gnu.so
x86_64-unknown-linux-gnu-gcc -shared -Wl,-z,relro -Wl,-z,now -Wl,--as-needed     -Wl,-z,relro -Wl,-z,now -Wl,--as-needed     -fno-semantic-interposition -fprofile-generate  Modules/_testinternalcapi.o   -o Modules/_testinternalcapi.cpython-312-x86_64-linux-gnu.so
x86_64-unknown-linux-gnu-gcc -shared -Wl,-z,relro -Wl,-z,now -Wl,--as-needed     -Wl,-z,relro -Wl,-z,now -Wl,--as-needed     -fno-semantic-interposition -fprofile-generate  Modules/_testcapimodule.o Modules/_testcapi/vectorcall.o Modules/_testcapi/vectorcall_limited.o Modules/_testcapi/heaptype.o Modules/_testcapi/abstract.o Modules/_testcapi/bytearray.o Modules/_testcapi/bytes.o Modules/_testcapi/unicode.o Modules/_testcapi/dict.o Modules/_testcapi/set.o Modules/_testcapi/list.o Modules/_testcapi/tuple.o Modules/_testcapi/getargs.o Modules/_testcapi/pytime.o Modules/_testcapi/datetime.o Modules/_testcapi/docstring.o Modules/_testcapi/mem.o Modules/_testcapi/watchers.o Modules/_testcapi/long.o Modules/_testcapi/float.o Modules/_testcapi/complex.o Modules/_testcapi/numbers.o Modules/_testcapi/structmember.o Modules/_testcapi/exceptions.o Modules/_testcapi/code.o Modules/_testcapi/buffer.o Modules/_testcapi/pyos.o Modules/_testcapi/file.o Modules/_testcapi/codec.o Modules/_testcapi/immortal.o Modules/_testcapi/heaptype_relative.o Modules/_testcapi/gc.o Modules/_testcapi/sys.o   -o Modules/_testcapi.cpython-312-x86_64-linux-gnu.so
x86_64-unknown-linux-gnu-gcc -shared -Wl,-z,relro -Wl,-z,now -Wl,--as-needed     -Wl,-z,relro -Wl,-z,now -Wl,--as-needed     -fno-semantic-interposition -fprofile-generate  Modules/_testclinic.o   -o Modules/_testclinic.cpython-312-x86_64-linux-gnu.so
x86_64-unknown-linux-gnu-gcc -shared -Wl,-z,relro -Wl,-z,now -Wl,--as-needed     -Wl,-z,relro -Wl,-z,now -Wl,--as-needed     -fno-semantic-interposition -fprofile-generate  Modules/_testimportmultiple.o   -o Modules/_testimportmultiple.cpython-312-x86_64-linux-gnu.so
/usr/bin/ld: /usr/lib/libz.a(zutil.o): warning: relocation against `z_errmsg' in read-only section `.text'
/usr/bin/ld: /usr/lib/libz.a(deflate.o): relocation R_X86_64_PC32 against symbol `z_errmsg' can not be used when making a shared object; recompile with -fPIC
/usr/bin/ld: final link failed: bad value
collect2: error: ld returned 1 exit status
make[2]: *** [Makefile:3022: Modules/zlib.cpython-312-x86_64-linux-gnu.so] Error 1
make[2]: *** Waiting for unfinished jobs....
make[2]: Leaving directory '/builddir/python3-3.12.1'
make[1]: *** [Makefile:795: profile-gen-stamp] Error 2
make[1]: Leaving directory '/builddir/python3-3.12.1'
make: *** [Makefile:807: profile-run-stamp] Error 2
=> ERROR: python3-3.12.1_1: do_build: '${make_cmd} ${makejobs} ${make_build_args} ${make_build_target}' exited with 2
=> ERROR:   in do_build() at common/build-style/gnu-configure.sh:15